Information card for entry 7034164
Formula | C42.5 H54.5 Cu5 I4 N9.5 P3 |
Calculated formula | C42.5 H54.5 Cu5 I4 N9.5 P3 |
Title of publication | Unexpected fragmentations of triphosphaferrocene - formation of supramolecular assemblies containing the (1,2,4-P3C2Mes2)(-) ligand. |
Authors of publication | Heindl, Claudia; Kuntz, Andrea; Peresypkina, Eugenia V.; Virovets, Alexander V.; Zabel, Manfred; Lüdeker, David; Brunklaus, Gunther; Scheer, Manfred |
Journal of publication | Dalton transactions (Cambridge, England : 2003) |
Year of publication | 2015 |
Journal volume | 44 |
Journal issue | 14 |
Pages of publication | 6502 - 6509 |
a | 13.4384 ± 0.0003 Å |
b | 14.3484 ± 0.0002 Å |
c | 15.578 ± 0.0004 Å |
α | 83.695 ± 0.002° |
β | 77.946 ± 0.002° |
γ | 80.48 ± 0.002° |
Cell volume | 2888.22 ± 0.11 Å3 |
Cell temperature | 123 ± 2 K |
Ambient diffraction temperature | 123 ± 2 K |
Number of distinct elements | 6 |
Space group number | 2 |
Hermann-Mauguin space group symbol | P -1 |
Hall space group symbol | -P 1 |
Residual factor for all reflections | 0.0289 |
Residual factor for significantly intense reflections | 0.0261 |
Weighted residual factors for significantly intense reflections | 0.0678 |
Weighted residual factors for all reflections included in the refinement | 0.0688 |
Goodness-of-fit parameter for all reflections included in the refinement | 1.047 |
Diffraction radiation probe | x-ray |
Diffraction radiation wavelength | 1.54184 Å |
Diffraction radiation type | CuKα |