Information card for entry 7034171
Formula | C117.5 H87 Cl7 Er4 N8 O18 S4 |
Calculated formula | C117.5 H87 Cl7 Er4 N8 O18 S4 |
Title of publication | New NIR-emissive tetranuclear Er(iii) complexes with 4-hydroxo-2,1,3-benzothiadiazolate and dibenzoylmethanide ligands: synthesis and characterization. |
Authors of publication | Sukhikh, Taisiya S.; Bashirov, Denis A.; Kuratieva, Natalia V.; Smolentsev, Anton I.; Bogomyakov, Artem S.; Burilov, Vladimir A.; Mustafina, Asia R.; Zibarev, Andrey V.; Konchenko, Sergey N. |
Journal of publication | Dalton transactions (Cambridge, England : 2003) |
Year of publication | 2015 |
Journal volume | 44 |
Journal issue | 12 |
Pages of publication | 5727 - 5734 |
a | 15.6938 ± 0.0004 Å |
b | 27.3924 ± 0.0008 Å |
c | 26.7304 ± 0.0008 Å |
α | 90° |
β | 93.327 ± 0.001° |
γ | 90° |
Cell volume | 11471.8 ± 0.6 Å3 |
Cell temperature | 150 ± 2 K |
Ambient diffraction temperature | 150 ± 2 K |
Number of distinct elements | 7 |
Space group number | 14 |
Hermann-Mauguin space group symbol | P 1 21/c 1 |
Hall space group symbol | -P 2ybc |
Residual factor for all reflections | 0.1566 |
Residual factor for significantly intense reflections | 0.0705 |
Weighted residual factors for significantly intense reflections | 0.168 |
Weighted residual factors for all reflections included in the refinement | 0.1949 |
Goodness-of-fit parameter for all reflections included in the refinement | 1.07 |
Diffraction radiation wavelength | 0.71073 Å |
Diffraction radiation type | MoKα |