Information card for entry 7034180
Formula | C24 H30 Cu N4 O2 |
Calculated formula | C24 H30 Cu N4 O2 |
SMILES | [Cu]12([N](N(c3ccccc3)C)=C(C=C(O1)C)C)OC(=CC(=[N]2N(c1ccccc1)C)C)C |
Title of publication | Synthesis, characterization and structure of nickel and copper compounds containing ligands derived from keto-enehydrazines and their catalytic application for aerobic oxidation of alcohols. |
Authors of publication | Gaona, Miguel Ángel; Montilla, Francisco; Álvarez, Eleuterio; Galindo, Agustín |
Journal of publication | Dalton transactions (Cambridge, England : 2003) |
Year of publication | 2015 |
Journal volume | 44 |
Journal issue | 14 |
Pages of publication | 6516 - 6525 |
a | 8.0551 ± 0.0013 Å |
b | 10.772 ± 0.002 Å |
c | 14.825 ± 0.002 Å |
α | 69.265 ± 0.003° |
β | 84.322 ± 0.004° |
γ | 78.302 ± 0.004° |
Cell volume | 1177.5 ± 0.3 Å3 |
Cell temperature | 213 ± 2 K |
Ambient diffraction temperature | 213 ± 2 K |
Number of distinct elements | 5 |
Space group number | 2 |
Hermann-Mauguin space group symbol | P -1 |
Hall space group symbol | -P 1 |
Residual factor for all reflections | 0.0922 |
Residual factor for significantly intense reflections | 0.0653 |
Weighted residual factors for significantly intense reflections | 0.1342 |
Weighted residual factors for all reflections included in the refinement | 0.2106 |
Goodness-of-fit parameter for all reflections included in the refinement | 1.098 |
Diffraction radiation wavelength | 0.71073 Å |
Diffraction radiation type | MoKα |