Information card for entry 7034182
Formula | Ge3 In0.25 Ni Yb1.75 |
Calculated formula | Ge3 In0.25 Ni Yb1.75 |
Title of publication | Yb7Ni4InGe12: a quaternary compound having mixed valent Yb atoms grown from indium flux. |
Authors of publication | Subbarao, Udumula; Jana, Rajkumar; Chondroudi, Maria; Balasubramanian, Mahalingam; Kanatzidis, Mercouri G.; Peter, Sebastian C. |
Journal of publication | Dalton transactions (Cambridge, England : 2003) |
Year of publication | 2015 |
Journal volume | 44 |
Journal issue | 12 |
Pages of publication | 5797 - 5804 |
a | 10.312 ± 0.0002 Å |
b | 10.312 ± 0.0002 Å |
c | 4.1586 ± 0.0001 Å |
α | 90° |
β | 90° |
γ | 90° |
Cell volume | 442.214 ± 0.016 Å3 |
Cell temperature | 293 ± 2 K |
Ambient diffraction temperature | 293 ± 2 K |
Number of distinct elements | 4 |
Space group number | 83 |
Hermann-Mauguin space group symbol | P 4/m |
Hall space group symbol | -P 4 |
Residual factor for all reflections | 0.0429 |
Residual factor for significantly intense reflections | 0.0418 |
Weighted residual factors for significantly intense reflections | 0.1088 |
Weighted residual factors for all reflections included in the refinement | 0.1127 |
Goodness-of-fit parameter for all reflections included in the refinement | 1.167 |
Diffraction radiation wavelength | 0.71073 Å |
Diffraction radiation type | MoKα |