Information card for entry 7034188
Formula | C32 H41 Cl N3 O2 Rh |
Calculated formula | C32 H41 Cl N3 O2 Rh |
Title of publication | Pyridine versus acetonitrile coordination in rhodium-N-heterocyclic carbene square-planar complexes. |
Authors of publication | Palacios, Laura; Di Giuseppe, Andrea; Castarlenas, Ricardo; Lahoz, Fernando J.; Pérez-Torrente, Jesús J; Oro, Luis A. |
Journal of publication | Dalton transactions (Cambridge, England : 2003) |
Year of publication | 2015 |
Journal volume | 44 |
Journal issue | 12 |
Pages of publication | 5777 - 5789 |
a | 17.4494 ± 0.001 Å |
b | 17.19 ± 0.001 Å |
c | 10.1596 ± 0.0006 Å |
α | 90° |
β | 90° |
γ | 90° |
Cell volume | 3047.4 ± 0.3 Å3 |
Cell temperature | 100 ± 2 K |
Ambient diffraction temperature | 100 ± 2 K |
Number of distinct elements | 6 |
Space group number | 62 |
Hermann-Mauguin space group symbol | P n m a |
Hall space group symbol | -P 2ac 2n |
Residual factor for all reflections | 0.0781 |
Residual factor for significantly intense reflections | 0.0348 |
Weighted residual factors for significantly intense reflections | 0.0715 |
Weighted residual factors for all reflections included in the refinement | 0.0861 |
Goodness-of-fit parameter for all reflections included in the refinement | 1.024 |
Diffraction radiation wavelength | 0.71073 Å |
Diffraction radiation type | MoKα |