Information card for entry 7034207
Formula | C14 H14 Cl2 Pd S2 |
Calculated formula | C14 H14 Cl2 Pd S2 |
SMILES | c1ccc([S]2CC[S](c3ccccc3)[Pd]2(Cl)Cl)cc1 |
Title of publication | Palladium(ii)-1-phenylthio-2-arylchalcogenoethane complexes: palladium phosphide nano-peanut and ribbon formation controlled by chalcogen and Suzuki coupling activation. |
Authors of publication | Kumar Rao, Gyandshwar; Kumar, Arun; Saleem, Fariha; Singh, Mahabir P.; Kumar, Satyendra; Kumar, Bharat; Mukherjee, Goutam; Singh, Ajai K. |
Journal of publication | Dalton transactions (Cambridge, England : 2003) |
Year of publication | 2015 |
Journal volume | 44 |
Journal issue | 14 |
Pages of publication | 6600 - 6612 |
a | 19.409 ± 0.01 Å |
b | 8.198 ± 0.004 Å |
c | 12.59 ± 0.007 Å |
α | 90° |
β | 125.942 ± 0.007° |
γ | 90° |
Cell volume | 1621.9 ± 1.5 Å3 |
Cell temperature | 273 ± 2 K |
Ambient diffraction temperature | 273 ± 2 K |
Number of distinct elements | 5 |
Space group number | 15 |
Hermann-Mauguin space group symbol | C 1 2/c 1 |
Hall space group symbol | -C 2yc |
Residual factor for all reflections | 0.0386 |
Residual factor for significantly intense reflections | 0.0354 |
Weighted residual factors for significantly intense reflections | 0.0817 |
Weighted residual factors for all reflections included in the refinement | 0.0831 |
Goodness-of-fit parameter for all reflections included in the refinement | 1.264 |
Diffraction radiation wavelength | 0.71073 Å |
Diffraction radiation type | MoKα |