Information card for entry 7034210
Formula | C25 H32 N4 O |
Calculated formula | C25 H32 N4 O |
SMILES | C(=O)c1ccc(CN(C)Cc2ccc(/C=N/c3c(cccc3C(C)C)C(C)C)[nH]2)[nH]1 |
Title of publication | Exhibition of the Brønsted acid-base character of a Schiff base in palladium(ii) complex formation: lithium complexation, fluxional properties and catalysis of Suzuki reactions in water. |
Authors of publication | Kumar, Rajnish; Mani, Ganesan |
Journal of publication | Dalton transactions (Cambridge, England : 2003) |
Year of publication | 2015 |
Journal volume | 44 |
Journal issue | 15 |
Pages of publication | 6896 - 6908 |
a | 9.0287 ± 0.0016 Å |
b | 9.7736 ± 0.0018 Å |
c | 14.728 ± 0.003 Å |
α | 95.194 ± 0.006° |
β | 91.309 ± 0.006° |
γ | 113.379 ± 0.005° |
Cell volume | 1185.6 ± 0.4 Å3 |
Cell temperature | 293 ± 2 K |
Ambient diffraction temperature | 293 ± 2 K |
Number of distinct elements | 4 |
Space group number | 2 |
Hermann-Mauguin space group symbol | P -1 |
Hall space group symbol | -P 1 |
Residual factor for all reflections | 0.1195 |
Residual factor for significantly intense reflections | 0.0606 |
Weighted residual factors for significantly intense reflections | 0.1568 |
Weighted residual factors for all reflections included in the refinement | 0.1938 |
Goodness-of-fit parameter for all reflections included in the refinement | 1.002 |
Diffraction radiation wavelength | 0.71073 Å |
Diffraction radiation type | MoKα |