Information card for entry 7034212
Formula | C37 H50 Cl2 N5 O0.5 Pd |
Calculated formula | C37 H49 Cl2 N5 O0.5 Pd |
Title of publication | Exhibition of the Brønsted acid-base character of a Schiff base in palladium(ii) complex formation: lithium complexation, fluxional properties and catalysis of Suzuki reactions in water. |
Authors of publication | Kumar, Rajnish; Mani, Ganesan |
Journal of publication | Dalton transactions (Cambridge, England : 2003) |
Year of publication | 2015 |
Journal volume | 44 |
Journal issue | 15 |
Pages of publication | 6896 - 6908 |
a | 9.898 ± 0.006 Å |
b | 10.527 ± 0.007 Å |
c | 20.359 ± 0.012 Å |
α | 82.68 ± 0.02° |
β | 87.07 ± 0.02° |
γ | 72.53 ± 0.02° |
Cell volume | 2007 ± 2 Å3 |
Cell temperature | 293 ± 2 K |
Ambient diffraction temperature | 293 ± 2 K |
Number of distinct elements | 6 |
Space group number | 2 |
Hermann-Mauguin space group symbol | P -1 |
Hall space group symbol | -P 1 |
Residual factor for all reflections | 0.122 |
Residual factor for significantly intense reflections | 0.0683 |
Weighted residual factors for significantly intense reflections | 0.1604 |
Weighted residual factors for all reflections included in the refinement | 0.189 |
Goodness-of-fit parameter for all reflections included in the refinement | 1.023 |
Diffraction radiation wavelength | 0.71073 Å |
Diffraction radiation type | MoKα |