Information card for entry 7034227
Formula | C15 H35 Cl4 Nb O5 Sn |
Calculated formula | C15 H35 Cl4 Nb O5 Sn |
Title of publication | A convenient and quantitative route to Sn(iv)-M [M = Ti(iv), Nb(v), Ta(v)] heterobimetallic precursors for dense mixed-metal oxide ceramics. |
Authors of publication | Mishra, Shashank; Jeanneau, Erwann; Mangematin, Stéphane; Chermette, Henry; Poor Kalhor, Mahboubeh; Bonnefont, Guillaume; Fantozzi, Gilbert; Le Floch, Sylvie; Pailhes, Stéphane; Daniele, Stéphane |
Journal of publication | Dalton transactions (Cambridge, England : 2003) |
Year of publication | 2015 |
Journal volume | 44 |
Journal issue | 15 |
Pages of publication | 6848 - 6862 |
a | 19.382 ± 0.002 Å |
b | 14.234 ± 0.002 Å |
c | 9.515 ± 0.001 Å |
α | 90° |
β | 90° |
γ | 90° |
Cell volume | 2625 ± 0.5 Å3 |
Cell temperature | 150 K |
Ambient diffraction temperature | 150 K |
Number of distinct elements | 6 |
Space group number | 62 |
Hermann-Mauguin space group symbol | P n m a |
Hall space group symbol | -P 2ac 2n |
Residual factor for all reflections | 0.0793 |
Residual factor for significantly intense reflections | 0.0349 |
Weighted residual factors for all reflections | 0.1069 |
Weighted residual factors for significantly intense reflections | 0.0623 |
Weighted residual factors for all reflections included in the refinement | 0.1069 |
Goodness-of-fit parameter for all reflections included in the refinement | 1.0476 |
Diffraction radiation wavelength | 0.71069 Å |
Diffraction radiation type | MoKα |