Information card for entry 7034260
Formula | C31 H30 Cl2 N2 O Ru |
Calculated formula | C31 H30 Cl2 N2 O Ru |
Title of publication | Ruthenium catalysts bearing a benzimidazolylidene ligand for the metathetical ring-closure of tetrasubstituted cycloolefins. |
Authors of publication | Borguet, Yannick; Zaragoza, Guillermo; Demonceau, Albert; Delaude, Lionel |
Journal of publication | Dalton transactions (Cambridge, England : 2003) |
Year of publication | 2015 |
Journal volume | 44 |
Journal issue | 21 |
Pages of publication | 9744 - 9755 |
a | 8.464 ± 0.0004 Å |
b | 32.1234 ± 0.0014 Å |
c | 10.6949 ± 0.0005 Å |
α | 90° |
β | 108.894 ± 0.003° |
γ | 90° |
Cell volume | 2751.2 ± 0.2 Å3 |
Cell temperature | 100 ± 2 K |
Ambient diffraction temperature | 100 ± 2 K |
Number of distinct elements | 6 |
Space group number | 14 |
Hermann-Mauguin space group symbol | P 1 21/n 1 |
Hall space group symbol | -P 2yn |
Residual factor for all reflections | 0.1214 |
Residual factor for significantly intense reflections | 0.0836 |
Weighted residual factors for significantly intense reflections | 0.1394 |
Weighted residual factors for all reflections included in the refinement | 0.1484 |
Goodness-of-fit parameter for all reflections included in the refinement | 1.325 |
Diffraction radiation probe | x-ray |
Diffraction radiation wavelength | 0.7107 Å |
Diffraction radiation type | MoKα |