Information card for entry 7034267
Formula | C5 H11 Cr0.5 N Na0.5 O6 |
Calculated formula | C5 H10.92 Cr0.5 N0.99 Na0.5 O6 |
Title of publication | Synthesis and characterization of [(CH3)2NH2][Na0.5Cr0.5(HCOO)3]: a rare example of luminescent metal-organic frameworks based on Cr(iii) ions. |
Authors of publication | Mączka, Mirosław; Bondzior, Bartosz; Dereń, Przemysław; Sieradzki, Adam; Trzmiel, Justyna; Pietraszko, Adam; Hanuza, J. |
Journal of publication | Dalton transactions (Cambridge, England : 2003) |
Year of publication | 2015 |
Journal volume | 44 |
Journal issue | 15 |
Pages of publication | 6871 - 6879 |
a | 8.3121 ± 0.0012 Å |
b | 8.3121 ± 0.0012 Å |
c | 22.778 ± 0.005 Å |
α | 90° |
β | 90° |
γ | 120° |
Cell volume | 1362.9 ± 0.4 Å3 |
Cell temperature | 115 ± 2 K |
Ambient diffraction temperature | 115 ± 2 K |
Number of distinct elements | 6 |
Space group number | 148 |
Hermann-Mauguin space group symbol | R -3 :H |
Hall space group symbol | -R 3 |
Residual factor for all reflections | 0.1203 |
Residual factor for significantly intense reflections | 0.0686 |
Weighted residual factors for significantly intense reflections | 0.1131 |
Weighted residual factors for all reflections included in the refinement | 0.1299 |
Goodness-of-fit parameter for all reflections included in the refinement | 1.098 |
Diffraction radiation wavelength | 0.71073 Å |
Diffraction radiation type | MoKα |