Information card for entry 7034272
Formula | C52 H43 B Cu F4 N3 O P2 |
Calculated formula | C52 H43 B Cu F4 N3 O P2 |
SMILES | [Cu]12([P](c3ccccc3)(c3ccccc3)c3ccccc3Oc3c([P]1(c1ccccc1)c1ccccc1)cccc3)[n]1n(c3ccc(C)cc3)ccc1c1[n]2c(C)ccc1.[B](F)(F)(F)[F-] |
Title of publication | Outstanding blue delayed fluorescence and significant processing stability of cuprous complexes with functional pyridine-pyrazolate diimine ligands. |
Authors of publication | Zhang, Qing; Chen, Jun; Wu, Xiao-Yuan; Chen, Xu-Lin; Yu, Rongmin; Lu, Can-Zhong |
Journal of publication | Dalton transactions (Cambridge, England : 2003) |
Year of publication | 2015 |
Journal volume | 44 |
Journal issue | 15 |
Pages of publication | 6706 - 6710 |
a | 24.814 ± 0.009 Å |
b | 15.188 ± 0.005 Å |
c | 15.388 ± 0.006 Å |
α | 90° |
β | 128.114 ± 0.006° |
γ | 90° |
Cell volume | 4563 ± 3 Å3 |
Cell temperature | 293 ± 2 K |
Ambient diffraction temperature | 293 ± 2 K |
Number of distinct elements | 8 |
Space group number | 9 |
Hermann-Mauguin space group symbol | C 1 c 1 |
Hall space group symbol | C -2yc |
Residual factor for all reflections | 0.0493 |
Residual factor for significantly intense reflections | 0.0453 |
Weighted residual factors for significantly intense reflections | 0.1244 |
Weighted residual factors for all reflections included in the refinement | 0.1296 |
Goodness-of-fit parameter for all reflections included in the refinement | 0.93 |
Diffraction radiation wavelength | 0.71073 Å |
Diffraction radiation type | MoKα |