Information card for entry 7034296
Formula | C46 H41 Al N2 O2 |
Calculated formula | C46 H41 Al N2 O2 |
Title of publication | Comparing a series of 8-quinolinolato complexes of aluminium, titanium and zinc as initiators for the ring-opening polymerization of rac-lactide. |
Authors of publication | Bakewell, Clare; Fateh-Iravani, Giovanna; Beh, Daniel W.; Myers, Dominic; Tabthong, Sittichoke; Hormnirun, Pimpa; White, Andrew J. P.; Long, Nicholas; Williams, Charlotte K. |
Journal of publication | Dalton transactions (Cambridge, England : 2003) |
Year of publication | 2015 |
Journal volume | 44 |
Journal issue | 27 |
Pages of publication | 12326 - 12337 |
a | 25.8123 ± 0.0007 Å |
b | 21.5571 ± 0.0004 Å |
c | 14.729 ± 0.0004 Å |
α | 90° |
β | 116.529 ± 0.003° |
γ | 90° |
Cell volume | 7332.8 ± 0.4 Å3 |
Cell temperature | 173 K |
Ambient diffraction temperature | 173 K |
Number of distinct elements | 5 |
Space group number | 15 |
Hermann-Mauguin space group symbol | C 1 2/c 1 |
Hall space group symbol | -C 2yc |
Residual factor for all reflections | 0.0773 |
Residual factor for significantly intense reflections | 0.0544 |
Weighted residual factors for significantly intense reflections | 0.1544 |
Weighted residual factors for all reflections included in the refinement | 0.1677 |
Goodness-of-fit parameter for all reflections included in the refinement | 1.1 |
Diffraction radiation wavelength | 0.71073 Å |
Diffraction radiation type | MoKα |