Information card for entry 7034299
Formula | C34 H46 Ni O2 P2 |
Calculated formula | C34 H46 Ni O2 P2 |
Title of publication | Reactions of phenylacetylene with nickel POCOP-pincer hydride complexes resulting in different outcomes from their palladium analogues. |
Authors of publication | Wilson, Gleason L. O.; Abraha, Medhanei; Krause, Jeanette A.; Guan, Hairong |
Journal of publication | Dalton transactions (Cambridge, England : 2003) |
Year of publication | 2015 |
Journal volume | 44 |
Journal issue | 27 |
Pages of publication | 12128 - 12136 |
a | 13.047 ± 0.0004 Å |
b | 16.0405 ± 0.0005 Å |
c | 14.9995 ± 0.0005 Å |
α | 90° |
β | 99.331 ± 0.002° |
γ | 90° |
Cell volume | 3097.57 ± 0.17 Å3 |
Cell temperature | 150 ± 2 K |
Ambient diffraction temperature | 150 ± 2 K |
Number of distinct elements | 5 |
Space group number | 14 |
Hermann-Mauguin space group symbol | P 1 21/n 1 |
Hall space group symbol | -P 2yn |
Residual factor for all reflections | 0.0971 |
Residual factor for significantly intense reflections | 0.0561 |
Weighted residual factors for significantly intense reflections | 0.1337 |
Weighted residual factors for all reflections included in the refinement | 0.1544 |
Goodness-of-fit parameter for all reflections included in the refinement | 0.996 |
Diffraction radiation wavelength | 1.54178 Å |
Diffraction radiation type | CuKα |