Information card for entry 7034313
Formula | C23 H24 Fe2 N2 O |
Calculated formula | C23 H24 Fe2 N2 O |
SMILES | [c]12([cH]3[cH]4[cH]5[cH]1[Fe]16782345[cH]2[cH]1[cH]6[cH]7[cH]82)CNC(=O)NC[c]12[cH]3[cH]4[cH]5[cH]1[Fe]16782345[cH]2[cH]1[cH]6[cH]7[cH]82 |
Title of publication | The effect of central and planar chirality on the electrochemical and chiral sensing properties of ferrocenyl urea H-bonding receptors. |
Authors of publication | Mulas, Andrea; Willener, Yasmine; Carr-Smith, James; Joly, Kevin M.; Male, Louise; Moody, Christopher J.; Horswell, Sarah L.; Nguyen, Huy V.; Tucker, James H. R. |
Journal of publication | Dalton transactions (Cambridge, England : 2003) |
Year of publication | 2015 |
Journal volume | 44 |
Journal issue | 16 |
Pages of publication | 7268 - 7275 |
a | 8.5102 ± 0.0004 Å |
b | 8.7702 ± 0.0005 Å |
c | 26.0912 ± 0.0015 Å |
α | 90° |
β | 90° |
γ | 90° |
Cell volume | 1947.35 ± 0.18 Å3 |
Cell temperature | 120 ± 2 K |
Ambient diffraction temperature | 120 ± 2 K |
Number of distinct elements | 5 |
Space group number | 19 |
Hermann-Mauguin space group symbol | P 21 21 21 |
Hall space group symbol | P 2ac 2ab |
Residual factor for all reflections | 0.0932 |
Residual factor for significantly intense reflections | 0.0671 |
Weighted residual factors for significantly intense reflections | 0.1164 |
Weighted residual factors for all reflections included in the refinement | 0.1287 |
Goodness-of-fit parameter for all reflections included in the refinement | 1.169 |
Diffraction radiation wavelength | 0.71073 Å |
Diffraction radiation type | MoKα |