Information card for entry 7034332
Formula | C69 H93 Cl17 N6 Ni |
Calculated formula | C69 H93 Cl17 N6 Ni |
Title of publication | Novel imidazolium and imidazolinium salts containing the 9-nickelafluorenyl anion - synthesis, structures and reactivity. |
Authors of publication | Buchalski, Piotr; Pacholski, Roman; Chodkiewicz, Krzysztof; Buchowicz, Włodzimierz; Suwińska, Kinga; Shkurenko, Aleksander |
Journal of publication | Dalton transactions (Cambridge, England : 2003) |
Year of publication | 2015 |
Journal volume | 44 |
Journal issue | 16 |
Pages of publication | 7169 - 7176 |
a | 15.3884 ± 0.0004 Å |
b | 15.3884 ± 0.0004 Å |
c | 61.781 ± 0.002 Å |
α | 90° |
β | 90° |
γ | 120° |
Cell volume | 12669.9 ± 0.6 Å3 |
Cell temperature | 100 ± 0.2 K |
Ambient diffraction temperature | 100 ± 0.2 K |
Number of distinct elements | 5 |
Space group number | 161 |
Hermann-Mauguin space group symbol | R 3 c :H |
Hall space group symbol | R 3 -2"c |
Residual factor for all reflections | 0.0691 |
Residual factor for significantly intense reflections | 0.0618 |
Weighted residual factors for significantly intense reflections | 0.1636 |
Weighted residual factors for all reflections included in the refinement | 0.1693 |
Goodness-of-fit parameter for all reflections included in the refinement | 1.067 |
Diffraction radiation wavelength | 0.71073 Å |
Diffraction radiation type | MoKα |