Information card for entry 7034344
Formula | C28 H27 N3 Pd |
Calculated formula | C28 H27 N3 Pd |
SMILES | [Pd]12(Nc3c(c4[n]2c(C(=[N]1c1ccc(cc1)C(C)C)C)ccc4)cccc3)c1ccccc1 |
Title of publication | Organo-palladium(ii) complexes bearing unsymmetrical N,N,N-pincer ligands: synthesis, structures and oxidatively induced coupling reactions. |
Authors of publication | Wright, Luka A.; Hope, Eric G.; Solan, Gregory A.; Cross, Warren B.; Singh, Kuldip |
Journal of publication | Dalton transactions (Cambridge, England : 2003) |
Year of publication | 2015 |
Journal volume | 44 |
Journal issue | 16 |
Pages of publication | 7230 - 7241 |
a | 17.244 ± 0.011 Å |
b | 11.142 ± 0.008 Å |
c | 12.238 ± 0.008 Å |
α | 90° |
β | 105.925 ± 0.014° |
γ | 90° |
Cell volume | 2261 ± 3 Å3 |
Cell temperature | 150 ± 2 K |
Ambient diffraction temperature | 150 ± 2 K |
Number of distinct elements | 4 |
Space group number | 14 |
Hermann-Mauguin space group symbol | P 1 21/c 1 |
Hall space group symbol | -P 2ybc |
Residual factor for all reflections | 0.1615 |
Residual factor for significantly intense reflections | 0.0732 |
Weighted residual factors for significantly intense reflections | 0.121 |
Weighted residual factors for all reflections included in the refinement | 0.145 |
Goodness-of-fit parameter for all reflections included in the refinement | 0.867 |
Diffraction radiation wavelength | 0.71073 Å |
Diffraction radiation type | MoKα |