Information card for entry 7034353
Formula | B5 Ba2 Cl O15 Pb6 |
Calculated formula | B5 Ba2 Cl O15 Pb6 |
Title of publication | Pb6Ba2(BO3)5X (X = Cl, Br): new borate halides with strong predicted optical anisotropies derived from Pb(2+) and (BO3)(3.). |
Authors of publication | Liu, Lu; Zhang, Bingbing; Zhang, Fangfang; Pan, Shilie; Zhang, Fangyuan; Zhang, Xingwen; Dong, Xiaoyu; Yang, Zhihua |
Journal of publication | Dalton transactions (Cambridge, England : 2003) |
Year of publication | 2015 |
Journal volume | 44 |
Journal issue | 15 |
Pages of publication | 7041 - 7047 |
a | 9.3155 ± 0.0007 Å |
b | 5.3958 ± 0.0005 Å |
c | 17.9757 ± 0.0017 Å |
α | 90° |
β | 101.172 ± 0.006° |
γ | 90° |
Cell volume | 886.42 ± 0.14 Å3 |
Cell temperature | 296 ± 2 K |
Ambient diffraction temperature | 296 ± 2 K |
Number of distinct elements | 5 |
Space group number | 12 |
Hermann-Mauguin space group symbol | C 1 2/m 1 |
Hall space group symbol | -C 2y |
Residual factor for all reflections | 0.0554 |
Residual factor for significantly intense reflections | 0.0465 |
Weighted residual factors for significantly intense reflections | 0.1033 |
Weighted residual factors for all reflections included in the refinement | 0.1063 |
Goodness-of-fit parameter for all reflections included in the refinement | 1.12 |
Diffraction radiation wavelength | 0.71073 Å |
Diffraction radiation type | MoKα |