Information card for entry 7034357
Chemical name | Cd8S(SPh)14(DMF)(bpy) coordination polymer |
Formula | C100 H90 Cd8 N4 O2 S15 |
Calculated formula | C100 H90 Cd8 N4 O2 S15 |
Title of publication | Photochemical CO2-reduction catalyzed by mono- and dinuclear phenanthroline-extended tetramesityl porphyrin complexes. |
Authors of publication | Matlachowski, Corinna; Schwalbe, Matthias |
Journal of publication | Dalton transactions (Cambridge, England : 2003) |
Year of publication | 2015 |
Journal volume | 44 |
Journal issue | 14 |
Pages of publication | 6480 - 6489 |
a | 13.5519 ± 0.0014 Å |
b | 26.283 ± 0.003 Å |
c | 32.05 ± 0.004 Å |
α | 90° |
β | 98.004 ± 0.007° |
γ | 90° |
Cell volume | 11305 ± 2 Å3 |
Cell temperature | 296 ± 2 K |
Ambient diffraction temperature | 296 ± 2 K |
Number of distinct elements | 6 |
Space group number | 14 |
Hermann-Mauguin space group symbol | P 1 21/n 1 |
Hall space group symbol | -P 2yn |
Residual factor for all reflections | 0.1694 |
Residual factor for significantly intense reflections | 0.0706 |
Weighted residual factors for significantly intense reflections | 0.1654 |
Weighted residual factors for all reflections included in the refinement | 0.2138 |
Goodness-of-fit parameter for all reflections included in the refinement | 1.026 |
Diffraction radiation wavelength | 0.71073 Å |
Diffraction radiation type | MoKα |