Information card for entry 7034364
Chemical name | (6-t-butyl-2-(diphenylphosphanyl)phenolato-O,P)-methyl-pyridine-nickel |
Formula | C28 H30 N Ni O P |
Calculated formula | C28 H30 N Ni O P |
SMILES | [Ni]1([P](c2c(O1)c(C(C)(C)C)ccc2)(c1ccccc1)c1ccccc1)([n]1ccccc1)C |
Title of publication | Well-defined phosphino-phenolate neutral nickel(ii) catalysts for efficient (co)polymerization of norbornene and ethylene. |
Authors of publication | Zhang, Yan-Ping; Li, Wei-Wei; Li, Bai-Xiang; Mu, Hong-Liang; Li, Yue-Sheng |
Journal of publication | Dalton transactions (Cambridge, England : 2003) |
Year of publication | 2015 |
Journal volume | 44 |
Journal issue | 16 |
Pages of publication | 7382 - 7394 |
a | 10.4122 ± 0.0007 Å |
b | 39.269 ± 0.002 Å |
c | 12.1425 ± 0.0008 Å |
α | 90° |
β | 90.994 ± 0.001° |
γ | 90° |
Cell volume | 4964 ± 0.5 Å3 |
Cell temperature | 185 ± 2 K |
Ambient diffraction temperature | 185 ± 2 K |
Number of distinct elements | 6 |
Space group number | 14 |
Hermann-Mauguin space group symbol | P 1 21/n 1 |
Hall space group symbol | -P 2yn |
Residual factor for all reflections | 0.0809 |
Residual factor for significantly intense reflections | 0.0572 |
Weighted residual factors for significantly intense reflections | 0.1293 |
Weighted residual factors for all reflections included in the refinement | 0.1412 |
Goodness-of-fit parameter for all reflections included in the refinement | 1.039 |
Diffraction radiation wavelength | 0.71073 Å |
Diffraction radiation type | MoKα |