Information card for entry 7034385
Formula | C8 H26 As N6 Nd S4 |
Calculated formula | C8 H26 As N6 Nd S4 |
Title of publication | A series of new lanthanoid thioarsenates: insights into the influence of lanthanide contraction on the formation of new lanthanoid thioarsenates. |
Authors of publication | Zhou, Jian; Zhao, Rong-Qing; Yang, Tao; Liu, Xing; Xiao, Hong-Ping; Zou, Hua-Hong; Tan, Xiao-Feng |
Journal of publication | Dalton transactions (Cambridge, England : 2003) |
Year of publication | 2015 |
Journal volume | 44 |
Journal issue | 16 |
Pages of publication | 7203 - 7212 |
a | 8.491 ± 0.01 Å |
b | 11.211 ± 0.013 Å |
c | 19.69 ± 0.02 Å |
α | 90° |
β | 90° |
γ | 90° |
Cell volume | 1874 ± 4 Å3 |
Cell temperature | 296 ± 2 K |
Ambient diffraction temperature | 296 ± 2 K |
Number of distinct elements | 6 |
Space group number | 19 |
Hermann-Mauguin space group symbol | P 21 21 21 |
Hall space group symbol | P 2ac 2ab |
Residual factor for all reflections | 0.0207 |
Residual factor for significantly intense reflections | 0.02 |
Weighted residual factors for significantly intense reflections | 0.0682 |
Weighted residual factors for all reflections included in the refinement | 0.0688 |
Goodness-of-fit parameter for all reflections included in the refinement | 1.183 |
Diffraction radiation wavelength | 0.71073 Å |
Diffraction radiation type | MoKα |