Information card for entry 7034390
Formula | C42 H10 B F26 P |
Calculated formula | C42 H10 B F26 P |
SMILES | [P+](F)(c1ccccc1)(c1c(F)c(F)c(F)c(F)c1F)c1ccccc1.Fc1c(F)c(F)c(c(F)c1F)[B-](c1c(F)c(F)c(F)c(F)c1F)(c1c(F)c(F)c(F)c(F)c1F)c1c(F)c(F)c(F)c(F)c1F |
Title of publication | Synthesis and Lewis acidity of fluorophosphonium cations. |
Authors of publication | Caputo, Christopher B.; Winkelhaus, Daniel; Dobrovetsky, Roman; Hounjet, Lindsay J.; Stephan, Douglas W. |
Journal of publication | Dalton transactions (Cambridge, England : 2003) |
Year of publication | 2015 |
Journal volume | 44 |
Journal issue | 27 |
Pages of publication | 12256 - 12264 |
a | 24.1133 ± 0.001 Å |
b | 10.8799 ± 0.0004 Å |
c | 16.1215 ± 0.0007 Å |
α | 90° |
β | 116.995 ± 0.002° |
γ | 90° |
Cell volume | 3768.7 ± 0.3 Å3 |
Cell temperature | 149 ± 2 K |
Ambient diffraction temperature | 149 ± 2 K |
Number of distinct elements | 5 |
Space group number | 9 |
Hermann-Mauguin space group symbol | C 1 c 1 |
Hall space group symbol | C -2yc |
Residual factor for all reflections | 0.0444 |
Residual factor for significantly intense reflections | 0.0361 |
Weighted residual factors for significantly intense reflections | 0.0863 |
Weighted residual factors for all reflections included in the refinement | 0.0908 |
Goodness-of-fit parameter for all reflections included in the refinement | 1.03 |
Diffraction radiation wavelength | 0.71073 Å |
Diffraction radiation type | MoKα |