Information card for entry 7034394
Formula | C42 H15 B F21 P |
Calculated formula | C42 H15 B F21 P |
SMILES | [P+](F)(c1ccccc1)(c1ccccc1)c1ccccc1.Fc1c(F)c(F)c(c(F)c1F)[B-](c1c(F)c(F)c(F)c(F)c1F)(c1c(F)c(F)c(F)c(F)c1F)c1c(F)c(F)c(F)c(F)c1F |
Title of publication | Synthesis and Lewis acidity of fluorophosphonium cations. |
Authors of publication | Caputo, Christopher B.; Winkelhaus, Daniel; Dobrovetsky, Roman; Hounjet, Lindsay J.; Stephan, Douglas W. |
Journal of publication | Dalton transactions (Cambridge, England : 2003) |
Year of publication | 2015 |
Journal volume | 44 |
Journal issue | 27 |
Pages of publication | 12256 - 12264 |
a | 25.3349 ± 0.0009 Å |
b | 11.1331 ± 0.0004 Å |
c | 18.031 ± 0.0011 Å |
α | 90° |
β | 132.675 ± 0.001° |
γ | 90° |
Cell volume | 3739.1 ± 0.3 Å3 |
Cell temperature | 150 ± 2 K |
Ambient diffraction temperature | 150 ± 2 K |
Number of distinct elements | 5 |
Space group number | 9 |
Hermann-Mauguin space group symbol | C 1 c 1 |
Hall space group symbol | C -2yc |
Residual factor for all reflections | 0.0735 |
Residual factor for significantly intense reflections | 0.0398 |
Weighted residual factors for significantly intense reflections | 0.0628 |
Weighted residual factors for all reflections included in the refinement | 0.0716 |
Goodness-of-fit parameter for all reflections included in the refinement | 0.998 |
Diffraction radiation wavelength | 0.71073 Å |
Diffraction radiation type | MoKα |