Information card for entry 7034402
Formula | C93 H96 Cl2 F12 Fe2 N6 O2 Os P6 |
Calculated formula | C93 H96 Cl2 F12 Fe2 N6 O2 Os P6 |
Title of publication | Influence of the central diamagnetic cyanidometal on the distant magnetic interaction in cyanide-bridged Fe(iii)-M(ii)-Fe(iii) complexes. |
Authors of publication | Wang, Yong; Lin, Chensheng; Ma, Xiao; Xue, Zhenzhen; Zhu, Xiaoquan; Cao, Wenhai; Hu, Shengmin; Sheng, Tianlu; Wu, Xintao |
Journal of publication | Dalton transactions (Cambridge, England : 2003) |
Year of publication | 2015 |
Journal volume | 44 |
Journal issue | 16 |
Pages of publication | 7437 - 7448 |
a | 11.259 ± 0.007 Å |
b | 34.41 ± 0.018 Å |
c | 23.606 ± 0.014 Å |
α | 90° |
β | 95.685 ± 0.012° |
γ | 90° |
Cell volume | 9101 ± 9 Å3 |
Cell temperature | 123 ± 2 K |
Ambient diffraction temperature | 123 ± 2 K |
Number of distinct elements | 9 |
Space group number | 14 |
Hermann-Mauguin space group symbol | P 1 21/n 1 |
Hall space group symbol | -P 2yn |
Residual factor for all reflections | 0.1254 |
Residual factor for significantly intense reflections | 0.0989 |
Weighted residual factors for significantly intense reflections | 0.1993 |
Weighted residual factors for all reflections included in the refinement | 0.2151 |
Goodness-of-fit parameter for all reflections included in the refinement | 1.047 |
Diffraction radiation wavelength | 0.71073 Å |
Diffraction radiation type | MoKα |