Information card for entry 7034413
Formula | C46 H40 Ir3 O8 P W2 |
Calculated formula | C46 H40 Ir3 O8 P W2 |
SMILES | [Ir]1234([Ir]56789%10%11([W]%12%13%14%15%162([Ir]21([W]1%17%18%1935%12([cH]3[cH]1[cH]%17[cH]%18[cH]%193)(C%11=O)C2=O)([P](c1ccccc1)(c1ccccc1)c1ccccc1)(C4=O)C#[O])([cH]1[cH]%16[cH]%15[cH]%14[cH]%131)(C#[O])C%10=O)[c]1([c]9([c]8([c]7([c]61C)C)C)C)C)(C#[O])C#[O] |
Title of publication | Phosphine, isocyanide, and alkyne reactivity at pentanuclear molybdenum/tungsten-iridium clusters. |
Authors of publication | Simpson, Peter V.; Randles, Michael D.; Gupta, Vivek; Fu, Junhong; Moxey, Graeme J.; Schwich, Torsten; Morshedi, Mahbod; Cifuentes, Marie P.; Humphrey, Mark G. |
Journal of publication | Dalton transactions (Cambridge, England : 2003) |
Year of publication | 2015 |
Journal volume | 44 |
Journal issue | 16 |
Pages of publication | 7292 - 7304 |
a | 9.889 ± 0.002 Å |
b | 10.453 ± 0.002 Å |
c | 22.59 ± 0.005 Å |
α | 77.38 ± 0.03° |
β | 88.45 ± 0.03° |
γ | 73.38 ± 0.03° |
Cell volume | 2181.9 ± 0.9 Å3 |
Cell temperature | 200 ± 2 K |
Ambient diffraction temperature | 200 ± 2 K |
Number of distinct elements | 6 |
Space group number | 2 |
Hermann-Mauguin space group symbol | P -1 |
Hall space group symbol | -P 1 |
Residual factor for all reflections | 0.0657 |
Residual factor for significantly intense reflections | 0.0613 |
Weighted residual factors for significantly intense reflections | 0.1696 |
Weighted residual factors for all reflections included in the refinement | 0.1733 |
Goodness-of-fit parameter for all reflections included in the refinement | 1.068 |
Diffraction radiation wavelength | 0.71073 Å |
Diffraction radiation type | MoKα |