Information card for entry 7034417
Formula | C52 H45 Ir3 Mo2 O4 |
Calculated formula | C52 H45 Ir3 Mo2 O4 |
Title of publication | Phosphine, isocyanide, and alkyne reactivity at pentanuclear molybdenum/tungsten-iridium clusters. |
Authors of publication | Simpson, Peter V.; Randles, Michael D.; Gupta, Vivek; Fu, Junhong; Moxey, Graeme J.; Schwich, Torsten; Morshedi, Mahbod; Cifuentes, Marie P.; Humphrey, Mark G. |
Journal of publication | Dalton transactions (Cambridge, England : 2003) |
Year of publication | 2015 |
Journal volume | 44 |
Journal issue | 16 |
Pages of publication | 7292 - 7304 |
a | 34.017 ± 0.0002 Å |
b | 35.8002 ± 0.0003 Å |
c | 12.7295 ± 0.0001 Å |
α | 90° |
β | 90° |
γ | 90° |
Cell volume | 15502.2 ± 0.2 Å3 |
Cell temperature | 200 ± 2 K |
Ambient diffraction temperature | 200 ± 2 K |
Number of distinct elements | 5 |
Space group number | 62 |
Hermann-Mauguin space group symbol | P n m a |
Hall space group symbol | -P 2ac 2n |
Residual factor for all reflections | 0.0434 |
Residual factor for significantly intense reflections | 0.032 |
Weighted residual factors for significantly intense reflections | 0.0822 |
Weighted residual factors for all reflections included in the refinement | 0.0862 |
Goodness-of-fit parameter for all reflections included in the refinement | 1.028 |
Diffraction radiation wavelength | 0.71073 Å |
Diffraction radiation type | MoKα |