Information card for entry 7034425
Formula | C42 H32 Co N8 O48 W12 Zn |
Calculated formula | C42 H32 Co N8 O48 W12 Zn |
Title of publication | Designed synthesis of a series of zwitterion-polyoxometalate hybrid materials for selective scavenging and photolysis of dyes. |
Authors of publication | Ou, Sha; Zheng, Jun-Ping; Kong, Guo-Qiang; Wu, Chuan-De |
Journal of publication | Dalton transactions (Cambridge, England : 2003) |
Year of publication | 2015 |
Journal volume | 44 |
Journal issue | 17 |
Pages of publication | 7862 - 7869 |
a | 21.018 ± 0.004 Å |
b | 30.814 ± 0.005 Å |
c | 19.639 ± 0.003 Å |
α | 90° |
β | 99.919 ± 0.015° |
γ | 90° |
Cell volume | 12529 ± 4 Å3 |
Cell temperature | 293 ± 2 K |
Ambient diffraction temperature | 293 ± 2 K |
Number of distinct elements | 7 |
Space group number | 15 |
Hermann-Mauguin space group symbol | C 1 2/c 1 |
Hall space group symbol | -C 2yc |
Residual factor for all reflections | 0.185 |
Residual factor for significantly intense reflections | 0.0881 |
Weighted residual factors for significantly intense reflections | 0.1826 |
Weighted residual factors for all reflections included in the refinement | 0.2092 |
Goodness-of-fit parameter for all reflections included in the refinement | 1.012 |
Diffraction radiation wavelength | 0.71073 Å |
Diffraction radiation type | MoKα |