Information card for entry 7034438
Formula | C20 H50 Cu2 F12 N4 O2 P2 |
Calculated formula | C20 H50 Cu2 F12 N4 O2 P2 |
Title of publication | Catalytic aerobic oxidation of phenols to ortho-quinones with air-stable copper precatalysts. |
Authors of publication | Askari, M. S.; Rodríguez-Solano, L A; Proppe, A.; McAllister, B.; Lumb, J.-P.; Ottenwaelder, X. |
Journal of publication | Dalton transactions (Cambridge, England : 2003) |
Year of publication | 2015 |
Journal volume | 44 |
Journal issue | 27 |
Pages of publication | 12094 - 12097 |
a | 24.87 ± 0.003 Å |
b | 16.8713 ± 0.0018 Å |
c | 18.708 ± 0.002 Å |
α | 90° |
β | 120.784 ± 0.001° |
γ | 90° |
Cell volume | 6743.7 ± 1.3 Å3 |
Cell temperature | 150 ± 2 K |
Ambient diffraction temperature | 150 ± 2 K |
Number of distinct elements | 7 |
Space group number | 15 |
Hermann-Mauguin space group symbol | C 1 2/c 1 |
Hall space group symbol | -C 2yc |
Residual factor for all reflections | 0.1043 |
Residual factor for significantly intense reflections | 0.0633 |
Weighted residual factors for significantly intense reflections | 0.1417 |
Weighted residual factors for all reflections included in the refinement | 0.1659 |
Goodness-of-fit parameter for all reflections included in the refinement | 1.115 |
Diffraction radiation wavelength | 0.71073 Å |
Diffraction radiation type | MoKα |