Information card for entry 7034450
Formula | C13 H15 F6 O2 P Ru |
Calculated formula | C13 H15 F6 O2 P Ru |
Title of publication | Colorless organometallic ionic liquids from cationic ruthenium sandwich complexes: thermal properties, liquid properties, and crystal structures of [Ru(η(5)-C5H5)(η(6)-C6H5R)][X] (X = N(SO2CF3)2, N(SO2F)2, PF6). |
Authors of publication | Komurasaki, Aina; Funasako, Yusuke; Mochida, Tomoyuki |
Journal of publication | Dalton transactions (Cambridge, England : 2003) |
Year of publication | 2015 |
Journal volume | 44 |
Journal issue | 16 |
Pages of publication | 7595 - 7605 |
a | 12.742 ± 0.004 Å |
b | 9.035 ± 0.003 Å |
c | 13.613 ± 0.004 Å |
α | 90° |
β | 90° |
γ | 90° |
Cell volume | 1567.2 ± 0.9 Å3 |
Cell temperature | 293 K |
Ambient diffraction temperature | 293 K |
Number of distinct elements | 6 |
Space group number | 62 |
Hermann-Mauguin space group symbol | P n m a |
Hall space group symbol | -P 2ac 2n |
Residual factor for all reflections | 0.033 |
Residual factor for significantly intense reflections | 0.0307 |
Weighted residual factors for significantly intense reflections | 0.0786 |
Weighted residual factors for all reflections included in the refinement | 0.0803 |
Goodness-of-fit parameter for all reflections included in the refinement | 1.083 |
Diffraction radiation wavelength | 0.71073 Å |
Diffraction radiation type | MoKα |