Information card for entry 7034460
Common name | TMC dioxoruthenium(VI) perchlorate |
Formula | C14 Cl2 N4 O10 Ru |
Calculated formula | C14 Cl2 N4 O10 Ru |
Title of publication | Mechanistic insights into the reactions of hydride transfer versus hydrogen atom transfer by a trans-dioxoruthenium(vi) complex. |
Authors of publication | Dhuri, Sunder N.; Lee, Yong-Min; Seo, Mi Sook; Cho, Jaeheung; Narulkar, Dattaprasad D.; Fukuzumi, Shunichi; Nam, Wonwoo |
Journal of publication | Dalton transactions (Cambridge, England : 2003) |
Year of publication | 2015 |
Journal volume | 44 |
Journal issue | 16 |
Pages of publication | 7634 - 7642 |
a | 6.3282 ± 0.0006 Å |
b | 16.982 ± 0.0017 Å |
c | 10.187 ± 0.001 Å |
α | 90° |
β | 94.132 ± 0.002° |
γ | 90° |
Cell volume | 1091.91 ± 0.18 Å3 |
Cell temperature | 170 ± 2 K |
Ambient diffraction temperature | 170 ± 2 K |
Number of distinct elements | 5 |
Space group number | 14 |
Hermann-Mauguin space group symbol | P 1 21/c 1 |
Hall space group symbol | -P 2ybc |
Residual factor for all reflections | 0.065 |
Residual factor for significantly intense reflections | 0.0543 |
Weighted residual factors for significantly intense reflections | 0.1534 |
Weighted residual factors for all reflections included in the refinement | 0.1574 |
Goodness-of-fit parameter for all reflections included in the refinement | 1.1 |
Diffraction radiation wavelength | 0.71073 Å |
Diffraction radiation type | MoKα |