Information card for entry 7034464
Formula | C41 H49 N O4 |
Calculated formula | C41 H49 N O4 |
Title of publication | Synthesis and structures of soluble magnesium and zinc carboxylates containing intramolecular NHO hydrogen bonds in nonpolar solvents. |
Authors of publication | Okamura, Taka-Aki; Furuya, Ryosuke; Onitsuka, Kiyotaka |
Journal of publication | Dalton transactions (Cambridge, England : 2003) |
Year of publication | 2015 |
Journal volume | 44 |
Journal issue | 16 |
Pages of publication | 7512 - 7523 |
a | 11.7369 ± 0.0014 Å |
b | 12.6605 ± 0.0017 Å |
c | 12.8455 ± 0.0017 Å |
α | 73.348 ± 0.005° |
β | 71.463 ± 0.005° |
γ | 83.617 ± 0.006° |
Cell volume | 1733.4 ± 0.4 Å3 |
Cell temperature | 200 K |
Ambient diffraction temperature | 200 K |
Number of distinct elements | 4 |
Space group number | 2 |
Hermann-Mauguin space group symbol | P -1 |
Hall space group symbol | -P 1 |
Residual factor for all reflections | 0.1258 |
Residual factor for significantly intense reflections | 0.0649 |
Weighted residual factors for significantly intense reflections | 0.1394 |
Weighted residual factors for all reflections included in the refinement | 0.1634 |
Goodness-of-fit parameter for all reflections included in the refinement | 1.033 |
Diffraction radiation wavelength | 0.71075 Å |
Diffraction radiation type | MoKα |