Information card for entry 7034478
Chemical name | [hdma](Fe5F8Ow2(amtetraz)4) |
Formula | C6 H20 F8 Fe5 N21 O2 |
Calculated formula | C6 H8 F8 Fe5 N21 O2 |
Title of publication | New iron tetrazolate frameworks: synthesis, temperature effect, thermal behaviour, Mössbauer and magnetic studies. |
Authors of publication | Pimenta, Vanessa; Le, Quang Hoang Hanh; Clark, Lucy; Lhoste, Jérôme; Hémon-Ribaud, Annie; Leblanc, Marc; Grenèche, Jean-Marc; Dujardin, Gilles; Lightfoot, Philip; Maisonneuve, Vincent |
Journal of publication | Dalton transactions (Cambridge, England : 2003) |
Year of publication | 2015 |
Journal volume | 44 |
Journal issue | 17 |
Pages of publication | 7951 - 7959 |
a | 6.6687 ± 0.0007 Å |
b | 12.245 ± 0.001 Å |
c | 9.0305 ± 0.0009 Å |
α | 90° |
β | 110.439 ± 0.006° |
γ | 90° |
Cell volume | 690.99 ± 0.12 Å3 |
Cell temperature | 150 ± 2 K |
Ambient diffraction temperature | 150 ± 2 K |
Number of distinct elements | 6 |
Space group number | 10 |
Hermann-Mauguin space group symbol | P 1 2/m 1 |
Hall space group symbol | -P 2y |
Residual factor for all reflections | 0.1502 |
Residual factor for significantly intense reflections | 0.0852 |
Weighted residual factors for significantly intense reflections | 0.2212 |
Weighted residual factors for all reflections included in the refinement | 0.2614 |
Goodness-of-fit parameter for all reflections included in the refinement | 1.06 |
Diffraction radiation wavelength | 0.71073 Å |
Diffraction radiation type | MoKα |