Information card for entry 7034486
Common name | compound 2 |
Formula | C16 H8 Ni O8 |
Calculated formula | C16 H8 Ni O8 |
Title of publication | Synthesis, structures and magnetic properties in 3d-electron-rich isostructural complexes based on chains with sole syn-anti carboxylate bridges. |
Authors of publication | Su, Feng; Lu, Liping; Feng, Sisi; Zhu, Miaoli; Gao, Zengqiang; Dong, Yuhui |
Journal of publication | Dalton transactions (Cambridge, England : 2003) |
Year of publication | 2015 |
Journal volume | 44 |
Journal issue | 16 |
Pages of publication | 7213 - 7222 |
a | 15.68 ± 0.003 Å |
b | 9.149 ± 0.0018 Å |
c | 9.415 ± 0.0019 Å |
α | 90° |
β | 90° |
γ | 90° |
Cell volume | 1350.6 ± 0.5 Å3 |
Cell temperature | 173 ± 2 K |
Ambient diffraction temperature | 173 ± 2 K |
Number of distinct elements | 4 |
Space group number | 60 |
Hermann-Mauguin space group symbol | P b c n |
Hall space group symbol | -P 2n 2ab |
Residual factor for all reflections | 0.0343 |
Residual factor for significantly intense reflections | 0.0297 |
Weighted residual factors for significantly intense reflections | 0.0763 |
Weighted residual factors for all reflections included in the refinement | 0.0778 |
Goodness-of-fit parameter for all reflections included in the refinement | 1.278 |
Diffraction radiation wavelength | 0.72 Å |
Diffraction radiation type | synchrotron |