Information card for entry 7034505
Formula | C27 H42 Ti |
Calculated formula | C27 H42 Ti |
SMILES | [Ti]123456789([c]%10([c]1([c]2([c]3([c]4%10C)C)C)C)C)([c]1([c]5([c]6([c]7([c]81C)C)C)C)C)[CH2]=[C]9=CC(C)(C)C |
Title of publication | Displacement of ethene from the decamethyltitanocene-ethene complex with internal alkynes, substituent-dependent alkyne-to-allene rearrangement, and the electronic transition relevant to the back-bonding interaction. |
Authors of publication | Pinkas, Jiří; Gyepes, Róbert; Císařová, Ivana; Kubišta, Jiří; Horáček, Michal; Mach, Karel |
Journal of publication | Dalton transactions (Cambridge, England : 2003) |
Year of publication | 2015 |
Journal volume | 44 |
Journal issue | 16 |
Pages of publication | 7276 - 7291 |
a | 14.8383 ± 0.0009 Å |
b | 11.7361 ± 0.0007 Å |
c | 14.7174 ± 0.0006 Å |
α | 90° |
β | 109.994 ± 0.002° |
γ | 90° |
Cell volume | 2408.5 ± 0.2 Å3 |
Cell temperature | 150 ± 2 K |
Ambient diffraction temperature | 150 ± 2 K |
Number of distinct elements | 3 |
Space group number | 14 |
Hermann-Mauguin space group symbol | P 1 21/c 1 |
Hall space group symbol | -P 2ybc |
Residual factor for all reflections | 0.0658 |
Residual factor for significantly intense reflections | 0.0425 |
Weighted residual factors for significantly intense reflections | 0.1012 |
Weighted residual factors for all reflections included in the refinement | 0.1115 |
Goodness-of-fit parameter for all reflections included in the refinement | 1.045 |
Diffraction radiation wavelength | 0.71073 Å |
Diffraction radiation type | MoKα |