Information card for entry 7034508
Formula | C42 H38 Cl12 O10 Ru2 |
Calculated formula | C42 H38 Cl12 O10 Ru2 |
SMILES | C1(c2c(c(cc(c2)Cl)Cl)Cl)=[O][Ru]234([O]=C(c5cc(Cl)cc(c5Cl)Cl)O[Ru]4([O]=C(c4c(c(cc(c4)Cl)Cl)Cl)O2)(O1)([O]=C(c1c(c(cc(c1)Cl)Cl)Cl)O3)[O]1CCCC1)[O]1CCCC1.CCCCCC |
Title of publication | The effect of chlorine and fluorine substitutions on tuning the ionization potential of benzoate-bridged paddlewheel diruthenium(ii, ii) complexes. |
Authors of publication | Kosaka, Wataru; Itoh, Masahisa; Miyasaka, Hitoshi |
Journal of publication | Dalton transactions (Cambridge, England : 2003) |
Year of publication | 2015 |
Journal volume | 44 |
Journal issue | 17 |
Pages of publication | 8156 - 8168 |
a | 9.988 ± 0.003 Å |
b | 10.925 ± 0.004 Å |
c | 11.72 ± 0.004 Å |
α | 86.02 ± 0.04° |
β | 76.5 ± 0.04° |
γ | 76.4 ± 0.04° |
Cell volume | 1208.5 ± 0.8 Å3 |
Cell temperature | 123 K |
Ambient diffraction temperature | 123 K |
Number of distinct elements | 5 |
Space group number | 2 |
Hermann-Mauguin space group symbol | P -1 |
Hall space group symbol | -P 1 |
Residual factor for significantly intense reflections | 0.0975 |
Weighted residual factors for all reflections included in the refinement | 0.2707 |
Goodness-of-fit parameter for all reflections included in the refinement | 1.045 |
Diffraction radiation wavelength | 0.7107 Å |
Diffraction radiation type | MoKα |