Information card for entry 7034519
Formula | C36 H28 Cl8 O10 Ru2 |
Calculated formula | C36 H28 Cl8 O10 Ru2 |
Title of publication | The effect of chlorine and fluorine substitutions on tuning the ionization potential of benzoate-bridged paddlewheel diruthenium(ii, ii) complexes. |
Authors of publication | Kosaka, Wataru; Itoh, Masahisa; Miyasaka, Hitoshi |
Journal of publication | Dalton transactions (Cambridge, England : 2003) |
Year of publication | 2015 |
Journal volume | 44 |
Journal issue | 17 |
Pages of publication | 8156 - 8168 |
a | 9.7894 ± 0.0009 Å |
b | 11.6023 ± 0.0009 Å |
c | 19.987 ± 0.002 Å |
α | 75.265 ± 0.004° |
β | 84.039 ± 0.005° |
γ | 69.065 ± 0.004° |
Cell volume | 2050.3 ± 0.3 Å3 |
Cell temperature | 97 K |
Ambient diffraction temperature | 97 K |
Number of distinct elements | 5 |
Space group number | 2 |
Hermann-Mauguin space group symbol | P -1 |
Hall space group symbol | -P 1 |
Residual factor for all reflections | 0.0964 |
Residual factor for significantly intense reflections | 0.0871 |
Weighted residual factors for significantly intense reflections | 0.2379 |
Weighted residual factors for all reflections included in the refinement | 0.2491 |
Goodness-of-fit parameter for all reflections included in the refinement | 1.075 |
Diffraction radiation wavelength | 0.71075 Å |
Diffraction radiation type | MoKα |