Information card for entry 7034532
Formula | C33 H30 Cl2 N4 O11 Zn |
Calculated formula | C33 H30 Cl2 N4 O11 Zn |
SMILES | [Zn]123[N](Cc4[n]1c1c(OC)cccc1cc4)(Cc1[n]2c2c(OC)cccc2cc1)Cc1[n]3c2c(OC)cccc2cc1.Cl(=O)(=O)(=O)[O-].Cl(=O)(=O)(=O)[O-] |
Title of publication | Tris(8-methoxy-2-quinolylmethyl)amine (8-MeOTQA) as a highly fluorescent Zn(2+) probe prepared by convenient C3-symmetric tripodal amine synthesis. |
Authors of publication | Mikata, Yuji; Nodomi, Yuki; Ohnishi, Risa; Kizu, Asako; Konno, Hideo |
Journal of publication | Dalton transactions (Cambridge, England : 2003) |
Year of publication | 2015 |
Journal volume | 44 |
Journal issue | 17 |
Pages of publication | 8021 - 8030 |
a | 18.484 ± 0.002 Å |
b | 11.4954 ± 0.0013 Å |
c | 15.595 ± 0.002 Å |
α | 90° |
β | 105.689 ± 0.0016° |
γ | 90° |
Cell volume | 3190.2 ± 0.6 Å3 |
Cell temperature | 153 K |
Ambient diffraction temperature | 153 K |
Number of distinct elements | 6 |
Space group number | 14 |
Hermann-Mauguin space group symbol | P 1 21/c 1 |
Hall space group symbol | -P 2ybc |
Residual factor for all reflections | 0.0367 |
Residual factor for significantly intense reflections | 0.0334 |
Weighted residual factors for significantly intense reflections | 0.0862 |
Weighted residual factors for all reflections included in the refinement | 0.0891 |
Goodness-of-fit parameter for all reflections included in the refinement | 1.061 |
Diffraction radiation wavelength | 0.71075 Å |
Diffraction radiation type | MoKα |