Information card for entry 7034536
Formula | C30 H34 Cd Cl2 N4 O12 |
Calculated formula | C30 H32 Cd Cl2 N4 O12 |
SMILES | [Cd]1234([O](c5cccc6ccc([n]2c56)C[N]1(Cc1[n]3c2c(OC)cccc2cc1)Cc1[n]4cccc1)C)OC.Cl(=O)(=O)(=O)[O-].Cl(=O)(=O)(=O)[O-].OC |
Title of publication | Tris(8-methoxy-2-quinolylmethyl)amine (8-MeOTQA) as a highly fluorescent Zn(2+) probe prepared by convenient C3-symmetric tripodal amine synthesis. |
Authors of publication | Mikata, Yuji; Nodomi, Yuki; Ohnishi, Risa; Kizu, Asako; Konno, Hideo |
Journal of publication | Dalton transactions (Cambridge, England : 2003) |
Year of publication | 2015 |
Journal volume | 44 |
Journal issue | 17 |
Pages of publication | 8021 - 8030 |
a | 17.838 ± 0.003 Å |
b | 11.9318 ± 0.0016 Å |
c | 15.668 ± 0.002 Å |
α | 90° |
β | 97.019 ± 0.0017° |
γ | 90° |
Cell volume | 3309.8 ± 0.8 Å3 |
Cell temperature | 153 K |
Ambient diffraction temperature | 153 K |
Number of distinct elements | 6 |
Space group number | 14 |
Hermann-Mauguin space group symbol | P 1 21/c 1 |
Hall space group symbol | -P 2ybc |
Residual factor for all reflections | 0.0498 |
Residual factor for significantly intense reflections | 0.044 |
Weighted residual factors for significantly intense reflections | 0.1149 |
Weighted residual factors for all reflections included in the refinement | 0.1201 |
Goodness-of-fit parameter for all reflections included in the refinement | 1.066 |
Diffraction radiation wavelength | 0.71075 Å |
Diffraction radiation type | MoKα |