Information card for entry 7034551
Common name | L5 |
Formula | C20 H24 N4 O2 |
Calculated formula | C20 H24 N4 O2 |
SMILES | COc1cccc(/C=N/[C@@H]2[C@H](CCCC2)/N=C/c2cccc(n2)OC)n1.COc1cccc(/C=N/[C@H]2[C@@H](CCCC2)/N=C/c2cccc(n2)OC)n1 |
Title of publication | Facile luminescent tuning of Zn(II)/Hg(II) complexes based on flexible, semi-rigid and rigid polydentate Schiff bases from blue to green to red: structural, photophysics, electrochemistry and theoretical calculations studies. |
Authors of publication | Wang, Xin-Ming; Chen, Shuo; Fan, Rui-Qing; Zhang, Fu-Qiang; Yang, Yu-Lin |
Journal of publication | Dalton transactions (Cambridge, England : 2003) |
Year of publication | 2015 |
Journal volume | 44 |
Journal issue | 17 |
Pages of publication | 8107 - 8125 |
a | 16.301 Å |
b | 9.193 Å |
c | 13.044 Å |
α | 90° |
β | 100.67° |
γ | 90° |
Cell volume | 1920.91 Å3 |
Cell temperature | 293 ± 2 K |
Ambient diffraction temperature | 293 ± 2 K |
Number of distinct elements | 4 |
Space group number | 15 |
Hermann-Mauguin space group symbol | C 1 2/c 1 |
Hall space group symbol | -C 2yc |
Residual factor for all reflections | 0.1448 |
Residual factor for significantly intense reflections | 0.0785 |
Weighted residual factors for significantly intense reflections | 0.2007 |
Weighted residual factors for all reflections included in the refinement | 0.25 |
Goodness-of-fit parameter for all reflections included in the refinement | 1.034 |
Diffraction radiation wavelength | 0.71073 Å |
Diffraction radiation type | MoKα |