Information card for entry 7034574
Formula | C10 H14 Cu0.28 O4 Zn0.67 |
Calculated formula | C10 H14 Cu0.28 O4 Zn0.67 |
Title of publication | Synthesis and characterization of bis (acetylacetonato κ-O, O') [zinc(ii)/copper(ii)] hybrid organic-inorganic complexes as solid metal organic precursors. |
Authors of publication | Rooydell, Reza; Wang, Ruey-Chi; Brahma, Sanjaya; Ebrahimzadeh, Farzaneh; Liu, Chuan-Pu |
Journal of publication | Dalton transactions (Cambridge, England : 2003) |
Year of publication | 2015 |
Journal volume | 44 |
Journal issue | 17 |
Pages of publication | 7982 - 7990 |
a | 10.329 ± 0.004 Å |
b | 4.6947 ± 0.0018 Å |
c | 11.369 ± 0.004 Å |
α | 90° |
β | 91.881 ± 0.006° |
γ | 90° |
Cell volume | 551 ± 0.4 Å3 |
Cell temperature | 296 ± 2 K |
Ambient diffraction temperature | 296 ± 2 K |
Number of distinct elements | 5 |
Space group number | 14 |
Hermann-Mauguin space group symbol | P 1 21/n 1 |
Hall space group symbol | -P 2yn |
Residual factor for all reflections | 0.0507 |
Residual factor for significantly intense reflections | 0.0323 |
Weighted residual factors for significantly intense reflections | 0.0779 |
Weighted residual factors for all reflections included in the refinement | 0.0872 |
Goodness-of-fit parameter for all reflections included in the refinement | 1.052 |
Diffraction radiation wavelength | 0.71073 Å |
Diffraction radiation type | MoKα |