Information card for entry 7034578
Formula | C18 H33 N12 O18 Sm |
Calculated formula | C18 H33 N12 O18 Sm |
Title of publication | Long-lived luminescent soft materials of hexanitratosamarate(iii) complexes with orange visible emission. |
Authors of publication | Tang, Ning; Zhao, Ying; He, Ling; Yuan, Wen-Li; Tao, Guo-Hong |
Journal of publication | Dalton transactions (Cambridge, England : 2003) |
Year of publication | 2015 |
Journal volume | 44 |
Journal issue | 19 |
Pages of publication | 8816 - 8823 |
a | 19.5624 ± 0.0004 Å |
b | 10.11895 ± 0.00018 Å |
c | 33.2256 ± 0.0006 Å |
α | 90° |
β | 101.291 ± 0.0018° |
γ | 90° |
Cell volume | 6449.7 ± 0.2 Å3 |
Cell temperature | 143 ± 2 K |
Ambient diffraction temperature | 143 ± 2 K |
Number of distinct elements | 5 |
Space group number | 15 |
Hermann-Mauguin space group symbol | C 1 2/c 1 |
Hall space group symbol | -C 2yc |
Residual factor for all reflections | 0.0339 |
Residual factor for significantly intense reflections | 0.0277 |
Weighted residual factors for significantly intense reflections | 0.0547 |
Weighted residual factors for all reflections included in the refinement | 0.057 |
Goodness-of-fit parameter for all reflections included in the refinement | 1.074 |
Diffraction radiation wavelength | 0.71073 Å |
Diffraction radiation type | MoKα |