Information card for entry 7034580
Formula | C32 H48 O P Ti |
Calculated formula | C32 H48 O P Ti |
Title of publication | Titanocene(iii) complexes with 2-phosphinoaryloxide ligands for the catalytic dehydrogenation of dimethylamine borane. |
Authors of publication | Klahn, Marcus; Hollmann, Dirk; Spannenberg, Anke; Brückner, Angelika; Beweries, Torsten |
Journal of publication | Dalton transactions (Cambridge, England : 2003) |
Year of publication | 2015 |
Journal volume | 44 |
Journal issue | 27 |
Pages of publication | 12103 - 12111 |
a | 17.2942 ± 0.0004 Å |
b | 10.2289 ± 0.0003 Å |
c | 18.3519 ± 0.0005 Å |
α | 90° |
β | 110.637 ± 0.001° |
γ | 90° |
Cell volume | 3038.14 ± 0.14 Å3 |
Cell temperature | 150 ± 2 K |
Ambient diffraction temperature | 150 ± 2 K |
Number of distinct elements | 5 |
Space group number | 14 |
Hermann-Mauguin space group symbol | P 1 21/n 1 |
Hall space group symbol | -P 2yn |
Residual factor for all reflections | 0.0426 |
Residual factor for significantly intense reflections | 0.0345 |
Weighted residual factors for significantly intense reflections | 0.0886 |
Weighted residual factors for all reflections included in the refinement | 0.0947 |
Goodness-of-fit parameter for all reflections included in the refinement | 1.038 |
Diffraction radiation wavelength | 0.71073 Å |
Diffraction radiation type | MoKα |