Information card for entry 7034596
Formula | C9 H20 Cl N O4 |
Calculated formula | C9 H20 Cl N O4 |
SMILES | Cl(=O)(=O)(=O)[O-].C1[N+](CCCC1)(C)CCC |
Title of publication | Crystal structures, phase transitions, and switchable dielectric behaviors: comparison of a series of N-heterocyclic ammonium perchlorates. |
Authors of publication | Shi, Ping-Ping; Ye, Qiong; Li, Qiang; Wang, Hui-Ting; Fu, Da-Wei; Zhang, Yi; Xiong, Ren-Gen |
Journal of publication | Dalton transactions (Cambridge, England : 2003) |
Year of publication | 2015 |
Journal volume | 44 |
Journal issue | 17 |
Pages of publication | 8221 - 8231 |
a | 8.0231 ± 0.0016 Å |
b | 12.525 ± 0.003 Å |
c | 12.668 ± 0.003 Å |
α | 90° |
β | 90° |
γ | 90° |
Cell volume | 1273 ± 0.5 Å3 |
Cell temperature | 293 ± 2 K |
Ambient diffraction temperature | 293 ± 2 K |
Number of distinct elements | 5 |
Space group number | 19 |
Hermann-Mauguin space group symbol | P 21 21 21 |
Hall space group symbol | P 2ac 2ab |
Residual factor for all reflections | 0.1245 |
Residual factor for significantly intense reflections | 0.1015 |
Weighted residual factors for significantly intense reflections | 0.2802 |
Weighted residual factors for all reflections included in the refinement | 0.3097 |
Goodness-of-fit parameter for all reflections included in the refinement | 1.163 |
Diffraction radiation wavelength | 0.71073 Å |
Diffraction radiation type | MoKα |