Information card for entry 7034607
Formula |
C56 H84 Mg N6 O5 |
Calculated formula |
C56 H84 Mg N6 O5 |
Title of publication |
1,3-Bis(2,4,6-trimethylphenyl)triazenides of potassium, magnesium, calcium, and strontium. |
Authors of publication |
Kalden, Diana; Krieck, Sven; Görls, Helmar; Westerhausen, Matthias |
Journal of publication |
Dalton transactions (Cambridge, England : 2003) |
Year of publication |
2015 |
Journal volume |
44 |
Journal issue |
17 |
Pages of publication |
8089 - 8099 |
a |
18.5897 ± 0.0005 Å |
b |
30.7897 ± 0.0006 Å |
c |
13.0053 ± 0.0003 Å |
α |
90° |
β |
132.269 ± 0.001° |
γ |
90° |
Cell volume |
5508.4 ± 0.2 Å3 |
Cell temperature |
133 ± 2 K |
Ambient diffraction temperature |
133 ± 2 K |
Number of distinct elements |
5 |
Space group number |
15 |
Hermann-Mauguin space group symbol |
C 1 2/c 1 |
Hall space group symbol |
-C 2yc |
Residual factor for all reflections |
0.0928 |
Residual factor for significantly intense reflections |
0.0826 |
Weighted residual factors for significantly intense reflections |
0.2203 |
Weighted residual factors for all reflections included in the refinement |
0.2281 |
Goodness-of-fit parameter for all reflections included in the refinement |
1.074 |
Diffraction radiation wavelength |
0.71073 Å |
Diffraction radiation type |
MoKα |
Yes |
Yes |
No |