Information card for entry 7034619
Formula | C5 H8 N4 O3 |
Calculated formula | C5 H8 N4 O3 |
SMILES | n1c(nn(c1OCC)C)N(=O)=O |
Title of publication | Preparation and characterization of 3,5-dinitro-1H-1,2,4-triazole. |
Authors of publication | Haiges, R.; Bélanger-Chabot, G; Kaplan, S. M.; Christe, K. O. |
Journal of publication | Dalton transactions (Cambridge, England : 2003) |
Year of publication | 2015 |
Journal volume | 44 |
Journal issue | 16 |
Pages of publication | 7586 - 7594 |
a | 6.6336 ± 0.0008 Å |
b | 7.6993 ± 0.0008 Å |
c | 8.5129 ± 0.0009 Å |
α | 83.636 ± 0.005° |
β | 73.035 ± 0.005° |
γ | 65.784 ± 0.006° |
Cell volume | 379.25 ± 0.08 Å3 |
Cell temperature | 100 ± 2 K |
Ambient diffraction temperature | 100 ± 2 K |
Number of distinct elements | 4 |
Space group number | 2 |
Hermann-Mauguin space group symbol | P -1 |
Hall space group symbol | -P 1 |
Residual factor for all reflections | 0.0321 |
Residual factor for significantly intense reflections | 0.03 |
Weighted residual factors for significantly intense reflections | 0.0823 |
Weighted residual factors for all reflections included in the refinement | 0.0841 |
Goodness-of-fit parameter for all reflections included in the refinement | 1.055 |
Diffraction radiation wavelength | 1.54178 Å |
Diffraction radiation type | CuKα |