Information card for entry 7034627
Formula | C93 H176 Fe16 O51.25 |
Calculated formula | C93 H176 Fe16 O51.25 |
Title of publication | Undecametallic and hexadecametallic ferric oxo-hydroxo/ethoxo pivalate clusters. |
Authors of publication | Baca, Svetlana G.; Speldrich, Manfred; van Leusen, Jan; Ellern, Arkady; Kögerler, Paul |
Journal of publication | Dalton transactions (Cambridge, England : 2003) |
Year of publication | 2015 |
Journal volume | 44 |
Journal issue | 17 |
Pages of publication | 7777 - 7780 |
a | 32.725 ± 0.004 Å |
b | 28.973 ± 0.004 Å |
c | 29.299 ± 0.004 Å |
α | 90° |
β | 90.576 ± 0.001° |
γ | 90° |
Cell volume | 27778 ± 6 Å3 |
Cell temperature | 173 ± 2 K |
Ambient diffraction temperature | 173 ± 2 K |
Number of distinct elements | 4 |
Space group number | 14 |
Hermann-Mauguin space group symbol | P 1 21/c 1 |
Hall space group symbol | -P 2ybc |
Residual factor for all reflections | 0.1238 |
Residual factor for significantly intense reflections | 0.076 |
Weighted residual factors for significantly intense reflections | 0.2002 |
Weighted residual factors for all reflections included in the refinement | 0.2402 |
Goodness-of-fit parameter for all reflections included in the refinement | 1.035 |
Diffraction radiation wavelength | 0.71073 Å |
Diffraction radiation type | MoKα |