Information card for entry 7034652
Formula | C37 H67 Cl5 N8 O3 |
Calculated formula | C37 H67 Cl5 N8 O3 |
Title of publication | Inducing magnetic communication in caged dinuclear Co(ii) systems. |
Authors of publication | Caballero-Jiménez, Judith; Habib, Fatemah; Ramírez-Rosales, Daniel; Grande-Aztatzi, Rafael; Merino, Gabriel; Korobkov, Ilia; Singh, Mukesh Kumar; Rajaraman, Gopalan; Reyes-Ortega, Yasmi; Murugesu, Muralee |
Journal of publication | Dalton transactions (Cambridge, England : 2003) |
Year of publication | 2015 |
Journal volume | 44 |
Journal issue | 18 |
Pages of publication | 8649 - 8659 |
a | 10.7107 ± 0.0002 Å |
b | 14.7465 ± 0.0003 Å |
c | 15.1857 ± 0.0003 Å |
α | 108.5 ± 0.001° |
β | 93.433 ± 0.001° |
γ | 94.351 ± 0.001° |
Cell volume | 2259.05 ± 0.08 Å3 |
Cell temperature | 200 ± 2 K |
Ambient diffraction temperature | 200 ± 2 K |
Number of distinct elements | 5 |
Space group number | 2 |
Hermann-Mauguin space group symbol | P -1 |
Hall space group symbol | -P 1 |
Residual factor for all reflections | 0.0967 |
Residual factor for significantly intense reflections | 0.0653 |
Weighted residual factors for significantly intense reflections | 0.183 |
Weighted residual factors for all reflections included in the refinement | 0.2066 |
Goodness-of-fit parameter for all reflections included in the refinement | 1.047 |
Diffraction radiation wavelength | 0.71073 Å |
Diffraction radiation type | MoKα |