Information card for entry 7034658
Formula | C50 H42 Cl5 Ir N2 P2 S |
Calculated formula | C50 H42 Cl5 Ir N2 P2 S |
Title of publication | Iridium-mediated C-S bond activation and transformation: organoiridium(iii) thioether, thiolato, sulfinato and thiyl radical compounds. Synthesis, mechanistic, spectral, electrochemical and theoretical aspects. |
Authors of publication | Das, Ujjwal; Ghorui, Tapas; Adhikari, Basab; Roy, Sima; Pramanik, Shuvam; Pramanik, Kausikisankar |
Journal of publication | Dalton transactions (Cambridge, England : 2003) |
Year of publication | 2015 |
Journal volume | 44 |
Journal issue | 18 |
Pages of publication | 8625 - 8639 |
a | 14.995 ± 0.01 Å |
b | 18.277 ± 0.012 Å |
c | 17.451 ± 0.011 Å |
α | 90° |
β | 90° |
γ | 90° |
Cell volume | 4783 ± 5 Å3 |
Cell temperature | 296 ± 2 K |
Ambient diffraction temperature | 296 ± 2 K |
Number of distinct elements | 7 |
Space group number | 36 |
Hermann-Mauguin space group symbol | C m c 21 |
Hall space group symbol | C 2c -2 |
Residual factor for all reflections | 0.0277 |
Residual factor for significantly intense reflections | 0.0262 |
Weighted residual factors for significantly intense reflections | 0.0627 |
Weighted residual factors for all reflections included in the refinement | 0.0633 |
Goodness-of-fit parameter for all reflections included in the refinement | 1.076 |
Diffraction radiation wavelength | 0.71073 Å |
Diffraction radiation type | MoKα |