Information card for entry 7034673
Formula | C106 H93 Ag0 Cu5 Hg2 O0 P4 S9 |
Calculated formula | C106 H93 Cu5 Hg2 P4 S9 |
Title of publication | Geometrically unprecedented 3-, 5- and 7-membered Hg(ii)-Cu(i) and Hg(ii)-Ag(i) thiolate clusters: precursors to intermetallics. |
Authors of publication | Gupta, Geetika; Chaturvedi, Jyotsna; Bhattacharya, Subrato |
Journal of publication | Dalton transactions (Cambridge, England : 2003) |
Year of publication | 2015 |
Journal volume | 44 |
Journal issue | 19 |
Pages of publication | 8932 - 8937 |
a | 24.3852 ± 0.0006 Å |
b | 16.4533 ± 0.0004 Å |
c | 26.4195 ± 0.0009 Å |
α | 90° |
β | 105.248 ± 0.003° |
γ | 90° |
Cell volume | 10226.8 ± 0.5 Å3 |
Cell temperature | 293 ± 2 K |
Ambient diffraction temperature | 293 K |
Number of distinct elements | 8 |
Space group number | 14 |
Hermann-Mauguin space group symbol | P 1 21/c 1 |
Hall space group symbol | -P 2ybc |
Residual factor for all reflections | 0.1801 |
Residual factor for significantly intense reflections | 0.0774 |
Weighted residual factors for significantly intense reflections | 0.1517 |
Weighted residual factors for all reflections included in the refinement | 0.1969 |
Goodness-of-fit parameter for all reflections included in the refinement | 1.014 |
Diffraction radiation wavelength | 0.71073 Å |
Diffraction radiation type | MoKα |