Information card for entry 7034688
Formula | C14 H12 Cl3 Mn N7 |
Calculated formula | C14 H12 Cl3 Mn N7 |
SMILES | c12cccc[n]2[Mn]([n]2c(cccc2)CN(C1)c1nnc(nn1)Cl)(Cl)Cl |
Title of publication | Structural, photophysical and magnetic properties of transition metal complexes based on the dipicolylamino-chloro-1,2,4,5-tetrazine ligand. |
Authors of publication | Nazarenko, Iuliia; Pop, Flavia; Sun, Qinchao; Hauser, Andreas; Lloret, Francesc; Julve, Miguel; El-Ghayoury, Abdelkrim; Avarvari, Narcis |
Journal of publication | Dalton transactions (Cambridge, England : 2003) |
Year of publication | 2015 |
Journal volume | 44 |
Journal issue | 19 |
Pages of publication | 8855 - 8866 |
a | 15.5753 ± 0.0011 Å |
b | 16.0648 ± 0.001 Å |
c | 7.3196 ± 0.0005 Å |
α | 90° |
β | 94.87 ± 0.007° |
γ | 90° |
Cell volume | 1824.9 ± 0.2 Å3 |
Cell temperature | 293 ± 2 K |
Ambient diffraction temperature | 293 ± 2 K |
Number of distinct elements | 5 |
Space group number | 12 |
Hermann-Mauguin space group symbol | C 1 2/m 1 |
Hall space group symbol | -C 2y |
Residual factor for all reflections | 0.1136 |
Residual factor for significantly intense reflections | 0.044 |
Weighted residual factors for significantly intense reflections | 0.0656 |
Weighted residual factors for all reflections included in the refinement | 0.0808 |
Goodness-of-fit parameter for all reflections included in the refinement | 1.006 |
Diffraction radiation wavelength | 0.71073 Å |
Diffraction radiation type | MoKα |